bug#24177: make test failed

classic Classic list List threaded Threaded
2 messages Options
Reply | Threaded
Open this post in threaded view
|

bug#24177: make test failed

Javier García
I'm reporting this because the terminal ask me to.  Hope it will be useful.

Best regards,

Javier




Making check in .
make[1]: se ingresa al directorio «/home/javi/Escritorio/automake-1.7»
sed -e 's,[@]datadir[@],/usr/local/share,g' -e 's,[@]PERL[@],/usr/bin/perl,g' -e 's,[@]configure_input[@],Makefile.  Generated from Makefile.in by configure.,g' -e 's,[@]PACKAGE[@],automake,g' -e 's,[@]VERSION[@],1.7,g' -e 's,[@]APIVERSION[@],1.7,g' < ./automake.in > automake
chmod +x automake
sed -e 's,[@]datadir[@],/usr/local/share,g' -e 's,[@]PERL[@],/usr/bin/perl,g' -e 's,[@]configure_input[@],Makefile.  Generated from Makefile.in by configure.,g' -e 's,[@]PACKAGE[@],automake,g' -e 's,[@]VERSION[@],1.7,g' -e 's,[@]APIVERSION[@],1.7,g' < ./aclocal.in > aclocal
chmod +x aclocal
make[1]: se sale del directorio «/home/javi/Escritorio/automake-1.7»
Making check in m4
make[1]: se ingresa al directorio «/home/javi/Escritorio/automake-1.7/m4»
make[1]: No se hace nada para «check».
make[1]: se sale del directorio «/home/javi/Escritorio/automake-1.7/m4»
Making check in lib
make[1]: se ingresa al directorio «/home/javi/Escritorio/automake-1.7/lib»
Making check in Automake
make[2]: se ingresa al directorio «/home/javi/Escritorio/automake-1.7/lib/Automake»
make[2]: No se hace nada para «check».
make[2]: se sale del directorio «/home/javi/Escritorio/automake-1.7/lib/Automake»
Making check in am
make[2]: se ingresa al directorio «/home/javi/Escritorio/automake-1.7/lib/am»
make[2]: No se hace nada para «check».
make[2]: se sale del directorio «/home/javi/Escritorio/automake-1.7/lib/am»
make[2]: se ingresa al directorio «/home/javi/Escritorio/automake-1.7/lib»
make[2]: No se hace nada para «check-am».
make[2]: se sale del directorio «/home/javi/Escritorio/automake-1.7/lib»
make[1]: se sale del directorio «/home/javi/Escritorio/automake-1.7/lib»
Making check in tests
make[1]: se ingresa al directorio «/home/javi/Escritorio/automake-1.7/tests»
make  defs
make[2]: se ingresa al directorio «/home/javi/Escritorio/automake-1.7/tests»
make[2]: «defs» está actualizado.
make[2]: se sale del directorio «/home/javi/Escritorio/automake-1.7/tests»
make  check-TESTS
make[2]: se ingresa al directorio «/home/javi/Escritorio/automake-1.7/tests»
PASS: acinclude.test
PASS: aclibobj.test
PASS: aclocal.test
PASS: aclocali.test
PASS: aclocali1.test
PASS: aclocalii.test
PASS: acoutnoq.test
PASS: acoutput.test
PASS: acoutput2.test
PASS: acoutqnl.test
PASS: acouttbs.test
PASS: acsilent.test
PASS: acsubst.test
PASS: acsubst2.test
PASS: all.test
PASS: alpha.test
PASS: amassign.test
PASS: ammissing.test
PASS: ansi.test
PASS: ansi2.test
PASS: ansi3.test
PASS: ansi4.test
PASS: ansi5.test
PASS: ansi6.test
PASS: ansi7.test
PASS: ansi8.test
PASS: ar.test
PASS: asm.test
PASS: autoheader.test
PASS: autoheader2.test
PASS: auxdir.test
XFAIL: auxdir2.test
PASS: backsl.test
PASS: backsl2.test
PASS: badline.test
PASS: badprog.test
PASS: block.test
PASS: canon.test
PASS: canon2.test
PASS: canon3.test
PASS: canon4.test
PASS: canon5.test
PASS: ccnoco.test
PASS: check.test
PASS: checkall.test
PASS: clean.test
PASS: colneq.test
PASS: colneq2.test
PASS: colon.test
PASS: colon2.test
PASS: colon3.test
PASS: colon4.test
PASS: colon5.test
PASS: colon6.test
PASS: colon7.test
PASS: comment.test
PASS: comment2.test
PASS: comment3.test
PASS: comment4.test
PASS: comment5.test
PASS: comment6.test
PASS: comment7.test
FAIL: compile_f_c_cxx.test
PASS: cond.test
PASS: cond2.test
PASS: cond3.test
PASS: cond4.test
PASS: cond5.test
PASS: cond6.test
PASS: cond7.test
PASS: cond8.test
PASS: cond9.test
PASS: cond10.test
PASS: cond11.test
PASS: cond12.test
PASS: cond13.test
PASS: cond14.test
PASS: cond15.test
PASS: cond16.test
XFAIL: cond17.test
PASS: cond18.test
PASS: cond19.test
PASS: cond20.test
PASS: cond21.test
PASS: cond22.test
PASS: cond23.test
PASS: cond24.test
PASS: cond25.test
PASS: condd.test
PASS: condincl.test
PASS: condincl2.test
PASS: condlib.test
PASS: condman.test
PASS: condman2.test
PASS: conf2.test
PASS: confdeps.test
PASS: confdist.test
PASS: confh.test
PASS: confh4.test
PASS: config.test
PASS: confincl.test
PASS: confsub.test
PASS: confvar.test
PASS: confvar2.test
PASS: copy.test
PASS: ctarget1.test
PASS: cxx.test
PASS: cxx2.test
PASS: cxxansi.test
PASS: cxxcpp.test
PASS: cxxlibobj.test
PASS: cxxlink.test
PASS: cxxnoc.test
PASS: cxxo.test
PASS: cygwin32.test
PASS: dash.test
PASS: defun.test
PASS: defun2.test
PASS: dejagnu.test
PASS: dejagnu2.test
PASS: depacl.test
PASS: depacl2.test
PASS: depcomp.test
PASS: depcomp2.test
PASS: depdist.test
PASS: depend.test
PASS: depend2.test
PASS: depend3.test
PASS: depend4.test
PASS: destdir.test
PASS: dirforbid.test
PASS: dirlist.test
PASS: discover.test
PASS: distcommon.test
PASS: distcommon2.test
PASS: distcommon3.test
PASS: distdir.test
PASS: distname.test
PASS: dollar.test
PASS: double.test
PASS: dup2.test
PASS: dup3.test
PASS: else.test
PASS: empty.test
PASS: empty2.test
PASS: empty3.test
PASS: empty4.test
PASS: error.test
PASS: exdir.test
FAIL: exdir2.test
PASS: exeext.test
PASS: exeext2.test
PASS: exsource.test
PASS: ext.test
PASS: ext2.test
PASS: extra.test
PASS: extra3.test
PASS: extra4.test
PASS: extra5.test
PASS: extra6.test
PASS: extra7.test
FAIL: flibs.test
PASS: fnoc.test
PASS: fo.test
PASS: fonly.test
PASS: fortdep.test
PASS: fpinst2.test
PASS: fpinstall.test
PASS: gcj.test
PASS: gcj2.test
PASS: gcj3.test
SKIP: gcj4.test
PASS: gcj5.test
PASS: getopt.test
FAIL: gettext.test
FAIL: gettext2.test
PASS: gnuwarn.test
PASS: gnits.test
PASS: gnits2.test
PASS: gnits3.test
PASS: header.test
PASS: implicit.test
PASS: include.test
PASS: include2.test
PASS: info.test
PASS: insh.test
PASS: insh2.test
PASS: install2.test
PASS: installdir.test
FAIL: installsh.test
PASS: instdata.test
PASS: instdata2.test
PASS: instexec.test
PASS: insthook.test
PASS: instman.test
PASS: instman2.test
PASS: interp.test
PASS: interp2.test
PASS: java.test
PASS: java2.test
PASS: javaprim.test
PASS: javasubst.test
FAIL: ldadd.test
FAIL: ldflags.test
PASS: lex.test
PASS: lex2.test
PASS: lex3.test
PASS: lex4.test
PASS: lex5.test
PASS: libobj2.test
PASS: libobj3.test
PASS: libobj4.test
PASS: libobj5.test
PASS: libobj7.test
PASS: libobj8.test
PASS: libobj10.test
PASS: libobj11.test
PASS: libobj12.test
FAIL: libobj12b.test
PASS: library.test
PASS: library2.test
FAIL: libtool.test
FAIL: libtool2.test
FAIL: libtool3.test
PASS: libtool4.test
FAIL: libtool5.test
FAIL: libtool6.test
PASS: link_c_cxx.test
PASS: link_dist.test
PASS: link_f_c.test
PASS: link_f_c_cxx.test
PASS: link_f_cxx.test
PASS: link_f_only.test
PASS: lisp.test
PASS: lisp2.test
FAIL: listval.test
FAIL: ltdeps.test
FAIL: ltlibobjs.test
PASS: maintclean.test
PASS: make.test
PASS: makevars.test
PASS: man.test
FAIL: man2.test
PASS: mclean.test
PASS: mdate.test
PASS: mdate2.test
PASS: mdate3.test
PASS: mdate4.test
PASS: mkinst2.test
PASS: mkinstall.test
FAIL: nobase.test
PASS: nodefine.test
PASS: nodefine2.test
PASS: nodep.test
PASS: nodepcomp.test
PASS: nodist.test
PASS: nodist2.test
PASS: noinst.test
PASS: noinstdir.test
PASS: nolink.test
PASS: nostdinc.test
PASS: number.test
PASS: obsolete.test
PASS: order.test
PASS: outdir.test
PASS: output.test
PASS: output2.test
PASS: output3.test
PASS: output4.test
PASS: output5.test
PASS: package.test
PASS: parse.test
PASS: percent.test
PASS: percent2.test
PASS: phony.test
PASS: pluseq.test
PASS: pluseq2.test
PASS: pluseq3.test
PASS: pluseq4.test
PASS: pluseq5.test
PASS: pluseq6.test
PASS: pluseq7.test
PASS: pluseq8.test
PASS: pluseq9.test
PASS: postproc.test
PASS: ppf77.test
PASS: pr2.test
PASS: pr9.test
FAIL: pr72.test
PASS: pr87.test
PASS: pr204.test
FAIL: pr211.test
PASS: pr220.test
PASS: pr224.test
PASS: pr229.test
PASS: pr243.test
PASS: pr266.test
PASS: pr279.test
PASS: pr279-2.test
PASS: pr287.test
PASS: pr300-lib.test
FAIL: pr300-ltlib.test
PASS: pr300-prog.test
FAIL: pr307.test
PASS: prefix.test
PASS: primary.test
PASS: primary2.test
PASS: proginst.test
PASS: python.test
PASS: python2.test
PASS: ranlib.test
PASS: recurs.test
PASS: recurs2.test
PASS: remake.test
PASS: remake2.test
PASS: remake3.test
PASS: req.test
PASS: required.test
FAIL: required2.test
PASS: rulepat.test
PASS: scripts.test
PASS: seenc.test
PASS: sinclude.test
PASS: sourcesub.test
PASS: sourcesub2.test
PASS: space.test
PASS: specflags.test
PASS: specflags2.test
PASS: specflags3.test
PASS: specflags6.test
PASS: specflags7.test
PASS: specflags8.test
PASS: specflags9.test
PASS: spell.test
PASS: spell2.test
PASS: spell3.test
PASS: spelling.test
PASS: stamph.test
PASS: stamph2.test
PASS: stdlib.test
PASS: strip.test
PASS: subdir.test
PASS: subdir2.test
PASS: subdir3.test
PASS: subdir4.test
XFAIL: subdir5.test
PASS: subdir6.test
PASS: subdir7.test
PASS: subdirbuiltsources.test
FAIL: subdircond.test
PASS: subdircond2.test
PASS: subdircond3.test
PASS: subobj.test
PASS: subobj2.test
PASS: subobj3.test
PASS: subobj4.test
PASS: subobj5.test
PASS: subobj6.test
PASS: subobj7.test
PASS: subobj8.test
FAIL: subobj9.test
PASS: subobjname.test
PASS: subpkg.test
FAIL: subst.test
PASS: substref.test
PASS: substtarg.test
PASS: suffix.test
FAIL: suffix2.test
PASS: suffix3.test
PASS: suffix4.test
FAIL: suffix5.test
PASS: suffix6.test
PASS: suffix7.test
FAIL: suffix8.test
PASS: suffix9.test
FAIL: suffix10.test
PASS: symlink.test
PASS: symlink2.test
PASS: symlink3.test
PASS: syntax.test
PASS: tags.test
PASS: tagsub.test
PASS: target.test
PASS: target-cflags.test
PASS: targetclash.test
PASS: texinfo.test
PASS: texinfo2.test
PASS: texinfo3.test
PASS: texinfo4.test
PASS: texinfo5.test
PASS: texinfo6.test
PASS: texinfo7.test
PASS: texinfo8.test
PASS: texinfo9.test
PASS: texinfo10.test
SKIP: texinfo13.test
SKIP: texinfo16.test
FAIL: transform.test
PASS: unused.test
PASS: vars.test
PASS: vars2.test
PASS: vars3.test
PASS: vartar.test
PASS: version.test
PASS: version2.test
PASS: version3.test
PASS: version4.test
PASS: version5.test
PASS: version6.test
PASS: vpath.test
PASS: vtexi.test
PASS: vtexi2.test
FAIL: warnopts.test
PASS: werror.test
PASS: whoami.test
PASS: xsource.test
PASS: yacc.test
PASS: yacc2.test
PASS: yacc3.test
PASS: yacc4.test
PASS: yacc5.test
PASS: yacc6.test
PASS: yacc7.test
PASS: yacc8.test
PASS: yaccpp.test
PASS: yaccvpath.test
=====================================
33 of 423 tests failed
(3 tests were not run)
Please report to [hidden email]
=====================================
make[2]: *** [check-TESTS] Error 1
make[2]: se sale del directorio «/home/javi/Escritorio/automake-1.7/tests»
make[1]: *** [check-am] Error 2
make[1]: se sale del directorio «/home/javi/Escritorio/automake-1.7/tests»
make: *** [check-recursive] Error 1

Reply | Threaded
Open this post in threaded view
|

bug#24177: make test failed

Mathieu Lirzin
Hello,

Javier García <[hidden email]> writes:

> I'm reporting this because the terminal ask me to. Hope it will be useful.
>
> Best regards,
>
> Javier
>
> Making check in .
> make[1]: se ingresa al directorio «/home/javi/Escritorio/automake-1.7»
> sed -e 's,[@]datadir[@],/usr/local/share,g' -e 's,[@]PERL[@],/usr/bin/perl,g' -e 's,[@]configure_input[@],Makefile. Generated from Makefile.in by configure.,g' -e 's,[@]PACKAGE[@],automake,g' -e 's,
> [@]VERSION[@],1.7,g' -e 's,[@]APIVERSION[@],1.7,g' < ./automake.in > automake
> chmod +x automake
> sed -e 's,[@]datadir[@],/usr/local/share,g' -e 's,[@]PERL[@],/usr/bin/perl,g' -e 's,[@]configure_input[@],Makefile. Generated from Makefile.in by configure.,g' -e 's,[@]PACKAGE[@],automake,g' -e 's,
> [@]VERSION[@],1.7,g' -e 's,[@]APIVERSION[@],1.7,g' < ./aclocal.in > aclocal
> chmod +x aclocal
> make[1]: se sale del directorio «/home/javi/Escritorio/automake-1.7»
> Making check in m4
> make[1]: se ingresa al directorio «/home/javi/Escritorio/automake-1.7/m4»
> make[1]: No se hace nada para «check».
> make[1]: se sale del directorio «/home/javi/Escritorio/automake-1.7/m4»
> Making check in lib
> make[1]: se ingresa al directorio «/home/javi/Escritorio/automake-1.7/lib»
> Making check in Automake
> make[2]: se ingresa al directorio «/home/javi/Escritorio/automake-1.7/lib/Automake»
> make[2]: No se hace nada para «check».
> make[2]: se sale del directorio «/home/javi/Escritorio/automake-1.7/lib/Automake»
> Making check in am
> make[2]: se ingresa al directorio «/home/javi/Escritorio/automake-1.7/lib/am»
> make[2]: No se hace nada para «check».
> make[2]: se sale del directorio «/home/javi/Escritorio/automake-1.7/lib/am»
> make[2]: se ingresa al directorio «/home/javi/Escritorio/automake-1.7/lib»
> make[2]: No se hace nada para «check-am».
> make[2]: se sale del directorio «/home/javi/Escritorio/automake-1.7/lib»
> make[1]: se sale del directorio «/home/javi/Escritorio/automake-1.7/lib»
> Making check in tests
> make[1]: se ingresa al directorio «/home/javi/Escritorio/automake-1.7/tests»
> make defs
> make[2]: se ingresa al directorio «/home/javi/Escritorio/automake-1.7/tests»
> make[2]: «defs» está actualizado.
> make[2]: se sale del directorio «/home/javi/Escritorio/automake-1.7/tests»
> make check-TESTS
> make[2]: se ingresa al directorio «/home/javi/Escritorio/automake-1.7/tests»
> PASS: acinclude.test
> PASS: aclibobj.test
> PASS: aclocal.test
> PASS: aclocali.test
> PASS: aclocali1.test
> PASS: aclocalii.test
> PASS: acoutnoq.test
> PASS: acoutput.test
> PASS: acoutput2.test
> PASS: acoutqnl.test
> PASS: acouttbs.test
> PASS: acsilent.test
> PASS: acsubst.test
> PASS: acsubst2.test
> PASS: all.test
> PASS: alpha.test
> PASS: amassign.test
> PASS: ammissing.test
> PASS: ansi.test
> PASS: ansi2.test
> PASS: ansi3.test
> PASS: ansi4.test
> PASS: ansi5.test
> PASS: ansi6.test
> PASS: ansi7.test
> PASS: ansi8.test
> PASS: ar.test
> PASS: asm.test
> PASS: autoheader.test
> PASS: autoheader2.test
> PASS: auxdir.test
> XFAIL: auxdir2.test
> PASS: backsl.test
> PASS: backsl2.test
> PASS: badline.test
> PASS: badprog.test
> PASS: block.test
> PASS: canon.test
> PASS: canon2.test
> PASS: canon3.test
> PASS: canon4.test
> PASS: canon5.test
> PASS: ccnoco.test
> PASS: check.test
> PASS: checkall.test
> PASS: clean.test
> PASS: colneq.test
> PASS: colneq2.test
> PASS: colon.test
> PASS: colon2.test
> PASS: colon3.test
> PASS: colon4.test
> PASS: colon5.test
> PASS: colon6.test
> PASS: colon7.test
> PASS: comment.test
> PASS: comment2.test
> PASS: comment3.test
> PASS: comment4.test
> PASS: comment5.test
> PASS: comment6.test
> PASS: comment7.test
> FAIL: compile_f_c_cxx.test
> PASS: cond.test
> PASS: cond2.test
> PASS: cond3.test
> PASS: cond4.test
> PASS: cond5.test
> PASS: cond6.test
> PASS: cond7.test
> PASS: cond8.test
> PASS: cond9.test
> PASS: cond10.test
> PASS: cond11.test
> PASS: cond12.test
> PASS: cond13.test
> PASS: cond14.test
> PASS: cond15.test
> PASS: cond16.test
> XFAIL: cond17.test
> PASS: cond18.test
> PASS: cond19.test
> PASS: cond20.test
> PASS: cond21.test
> PASS: cond22.test
> PASS: cond23.test
> PASS: cond24.test
> PASS: cond25.test
> PASS: condd.test
> PASS: condincl.test
> PASS: condincl2.test
> PASS: condlib.test
> PASS: condman.test
> PASS: condman2.test
> PASS: conf2.test
> PASS: confdeps.test
> PASS: confdist.test
> PASS: confh.test
> PASS: confh4.test
> PASS: config.test
> PASS: confincl.test
> PASS: confsub.test
> PASS: confvar.test
> PASS: confvar2.test
> PASS: copy.test
> PASS: ctarget1.test
> PASS: cxx.test
> PASS: cxx2.test
> PASS: cxxansi.test
> PASS: cxxcpp.test
> PASS: cxxlibobj.test
> PASS: cxxlink.test
> PASS: cxxnoc.test
> PASS: cxxo.test
> PASS: cygwin32.test
> PASS: dash.test
> PASS: defun.test
> PASS: defun2.test
> PASS: dejagnu.test
> PASS: dejagnu2.test
> PASS: depacl.test
> PASS: depacl2.test
> PASS: depcomp.test
> PASS: depcomp2.test
> PASS: depdist.test
> PASS: depend.test
> PASS: depend2.test
> PASS: depend3.test
> PASS: depend4.test
> PASS: destdir.test
> PASS: dirforbid.test
> PASS: dirlist.test
> PASS: discover.test
> PASS: distcommon.test
> PASS: distcommon2.test
> PASS: distcommon3.test
> PASS: distdir.test
> PASS: distname.test
> PASS: dollar.test
> PASS: double.test
> PASS: dup2.test
> PASS: dup3.test
> PASS: else.test
> PASS: empty.test
> PASS: empty2.test
> PASS: empty3.test
> PASS: empty4.test
> PASS: error.test
> PASS: exdir.test
> FAIL: exdir2.test
> PASS: exeext.test
> PASS: exeext2.test
> PASS: exsource.test
> PASS: ext.test
> PASS: ext2.test
> PASS: extra.test
> PASS: extra3.test
> PASS: extra4.test
> PASS: extra5.test
> PASS: extra6.test
> PASS: extra7.test
> FAIL: flibs.test
> PASS: fnoc.test
> PASS: fo.test
> PASS: fonly.test
> PASS: fortdep.test
> PASS: fpinst2.test
> PASS: fpinstall.test
> PASS: gcj.test
> PASS: gcj2.test
> PASS: gcj3.test
> SKIP: gcj4.test
> PASS: gcj5.test
> PASS: getopt.test
> FAIL: gettext.test
> FAIL: gettext2.test
> PASS: gnuwarn.test
> PASS: gnits.test
> PASS: gnits2.test
> PASS: gnits3.test
> PASS: header.test
> PASS: implicit.test
> PASS: include.test
> PASS: include2.test
> PASS: info.test
> PASS: insh.test
> PASS: insh2.test
> PASS: install2.test
> PASS: installdir.test
> FAIL: installsh.test
> PASS: instdata.test
> PASS: instdata2.test
> PASS: instexec.test
> PASS: insthook.test
> PASS: instman.test
> PASS: instman2.test
> PASS: interp.test
> PASS: interp2.test
> PASS: java.test
> PASS: java2.test
> PASS: javaprim.test
> PASS: javasubst.test
> FAIL: ldadd.test
> FAIL: ldflags.test
> PASS: lex.test
> PASS: lex2.test
> PASS: lex3.test
> PASS: lex4.test
> PASS: lex5.test
> PASS: libobj2.test
> PASS: libobj3.test
> PASS: libobj4.test
> PASS: libobj5.test
> PASS: libobj7.test
> PASS: libobj8.test
> PASS: libobj10.test
> PASS: libobj11.test
> PASS: libobj12.test
> FAIL: libobj12b.test
> PASS: library.test
> PASS: library2.test
> FAIL: libtool.test
> FAIL: libtool2.test
> FAIL: libtool3.test
> PASS: libtool4.test
> FAIL: libtool5.test
> FAIL: libtool6.test
> PASS: link_c_cxx.test
> PASS: link_dist.test
> PASS: link_f_c.test
> PASS: link_f_c_cxx.test
> PASS: link_f_cxx.test
> PASS: link_f_only.test
> PASS: lisp.test
> PASS: lisp2.test
> FAIL: listval.test
> FAIL: ltdeps.test
> FAIL: ltlibobjs.test
> PASS: maintclean.test
> PASS: make.test
> PASS: makevars.test
> PASS: man.test
> FAIL: man2.test
> PASS: mclean.test
> PASS: mdate.test
> PASS: mdate2.test
> PASS: mdate3.test
> PASS: mdate4.test
> PASS: mkinst2.test
> PASS: mkinstall.test
> FAIL: nobase.test
> PASS: nodefine.test
> PASS: nodefine2.test
> PASS: nodep.test
> PASS: nodepcomp.test
> PASS: nodist.test
> PASS: nodist2.test
> PASS: noinst.test
> PASS: noinstdir.test
> PASS: nolink.test
> PASS: nostdinc.test
> PASS: number.test
> PASS: obsolete.test
> PASS: order.test
> PASS: outdir.test
> PASS: output.test
> PASS: output2.test
> PASS: output3.test
> PASS: output4.test
> PASS: output5.test
> PASS: package.test
> PASS: parse.test
> PASS: percent.test
> PASS: percent2.test
> PASS: phony.test
> PASS: pluseq.test
> PASS: pluseq2.test
> PASS: pluseq3.test
> PASS: pluseq4.test
> PASS: pluseq5.test
> PASS: pluseq6.test
> PASS: pluseq7.test
> PASS: pluseq8.test
> PASS: pluseq9.test
> PASS: postproc.test
> PASS: ppf77.test
> PASS: pr2.test
> PASS: pr9.test
> FAIL: pr72.test
> PASS: pr87.test
> PASS: pr204.test
> FAIL: pr211.test
> PASS: pr220.test
> PASS: pr224.test
> PASS: pr229.test
> PASS: pr243.test
> PASS: pr266.test
> PASS: pr279.test
> PASS: pr279-2.test
> PASS: pr287.test
> PASS: pr300-lib.test
> FAIL: pr300-ltlib.test
> PASS: pr300-prog.test
> FAIL: pr307.test
> PASS: prefix.test
> PASS: primary.test
> PASS: primary2.test
> PASS: proginst.test
> PASS: python.test
> PASS: python2.test
> PASS: ranlib.test
> PASS: recurs.test
> PASS: recurs2.test
> PASS: remake.test
> PASS: remake2.test
> PASS: remake3.test
> PASS: req.test
> PASS: required.test
> FAIL: required2.test
> PASS: rulepat.test
> PASS: scripts.test
> PASS: seenc.test
> PASS: sinclude.test
> PASS: sourcesub.test
> PASS: sourcesub2.test
> PASS: space.test
> PASS: specflags.test
> PASS: specflags2.test
> PASS: specflags3.test
> PASS: specflags6.test
> PASS: specflags7.test
> PASS: specflags8.test
> PASS: specflags9.test
> PASS: spell.test
> PASS: spell2.test
> PASS: spell3.test
> PASS: spelling.test
> PASS: stamph.test
> PASS: stamph2.test
> PASS: stdlib.test
> PASS: strip.test
> PASS: subdir.test
> PASS: subdir2.test
> PASS: subdir3.test
> PASS: subdir4.test
> XFAIL: subdir5.test
> PASS: subdir6.test
> PASS: subdir7.test
> PASS: subdirbuiltsources.test
> FAIL: subdircond.test
> PASS: subdircond2.test
> PASS: subdircond3.test
> PASS: subobj.test
> PASS: subobj2.test
> PASS: subobj3.test
> PASS: subobj4.test
> PASS: subobj5.test
> PASS: subobj6.test
> PASS: subobj7.test
> PASS: subobj8.test
> FAIL: subobj9.test
> PASS: subobjname.test
> PASS: subpkg.test
> FAIL: subst.test
> PASS: substref.test
> PASS: substtarg.test
> PASS: suffix.test
> FAIL: suffix2.test
> PASS: suffix3.test
> PASS: suffix4.test
> FAIL: suffix5.test
> PASS: suffix6.test
> PASS: suffix7.test
> FAIL: suffix8.test
> PASS: suffix9.test
> FAIL: suffix10.test
> PASS: symlink.test
> PASS: symlink2.test
> PASS: symlink3.test
> PASS: syntax.test
> PASS: tags.test
> PASS: tagsub.test
> PASS: target.test
> PASS: target-cflags.test
> PASS: targetclash.test
> PASS: texinfo.test
> PASS: texinfo2.test
> PASS: texinfo3.test
> PASS: texinfo4.test
> PASS: texinfo5.test
> PASS: texinfo6.test
> PASS: texinfo7.test
> PASS: texinfo8.test
> PASS: texinfo9.test
> PASS: texinfo10.test
> SKIP: texinfo13.test
> SKIP: texinfo16.test
> FAIL: transform.test
> PASS: unused.test
> PASS: vars.test
> PASS: vars2.test
> PASS: vars3.test
> PASS: vartar.test
> PASS: version.test
> PASS: version2.test
> PASS: version3.test
> PASS: version4.test
> PASS: version5.test
> PASS: version6.test
> PASS: vpath.test
> PASS: vtexi.test
> PASS: vtexi2.test
> FAIL: warnopts.test
> PASS: werror.test
> PASS: whoami.test
> PASS: xsource.test
> PASS: yacc.test
> PASS: yacc2.test
> PASS: yacc3.test
> PASS: yacc4.test
> PASS: yacc5.test
> PASS: yacc6.test
> PASS: yacc7.test
> PASS: yacc8.test
> PASS: yaccpp.test
> PASS: yaccvpath.test
> =====================================
> 33 of 423 tests failed
> (3 tests were not run)
> Please report to [hidden email]
> =====================================
> make[2]: *** [check-TESTS] Error 1
> make[2]: se sale del directorio «/home/javi/Escritorio/automake-1.7/tests»
> make[1]: *** [check-am] Error 2
> make[1]: se sale del directorio «/home/javi/Escritorio/automake-1.7/tests»
> make: *** [check-recursive] Error 1

Automake 1.7 is quite old so it is expected that some tests might fail.
As a consequence I am closing this bug.  Feel free to reopen it if the
test suite still fails with 'Automake 1.15.1'.

Thanks for the bug report.

--
Mathieu Lirzin
GPG: F2A3 8D7E EB2B 6640 5761  070D 0ADE E100 9460 4D37